AWARE SYSTEMS
TIFF and LibTiff Mail List Archive

Thread

2006.08.01 14:21 "[Tiff] Fwd: Help *** [libtiff.la] Error 1: On Solaris at Compilations", by Dotun Olafunmiloye
2006.08.01 15:43 "Re: [Tiff] Fwd: Help *** [libtiff.la] Error 1: On Solaris at Compilations", by Bob Friesenhahn

2006.08.01 14:21 "[Tiff] Fwd: Help *** [libtiff.la] Error 1: On Solaris at Compilations", by Dotun Olafunmiloye

Hello,

I am trying to compile libtiff 3.8.4 on solaris with ojpeg enabled, but make dies when it enters the libtiff subdirectory with libtiff.la errors. Snapshot of the errors below;

I'll appreciate all tips and hints to overcome this problem

make all-am
make[1]: Entering directory `/export/home/dotun/tiff-3.8.2/libtiff'

memcpy                              0x80        /usr/local/lib/libz.a(
infutil.o)
memcpy                              0xc4        /usr/local/lib/libz.a(
infutil.o)
memcpy                              0x150       /usr/local/lib/libz.a(
infutil.o)
free                                0x40        /usr/local/lib/libz.a(
zutil.o)
calloc                              0x2c        /usr/local/lib/libz.a(
zutil.o)
calloc                              0x30        /usr/local/lib/libz.a(

zutil.o)

ld: fatal: relocations remain against allocatable but non-writable sections collect2: ld returned 1 exit status

make[1]: *** [libtiff.la] Error 1
make[1]: Leaving directory `/export/home/dotun/tiff-3.8.2/libtiff'
make: *** [all] Error 2

Many Thanks,

--
_______________________________
Dotun Olafunmiloye
dotuno@gmail.com